{"text_format":"1","workbook":"xlsx","n_sheets":5,"sheets":["FP","EG ","QU","Levels","EM"],"not_rendered":{"charts":0,"images":2,"macros":1,"external_links":0,"defined_names":0,"comments":0,"pivot_tables":0},"unopened":[],"bounds":{"document_bytes":16777216,"sheet_cells":100000,"rows_first":2000,"rows_last":500,"rows_between":2000,"halvings":0,"cell_chars":16384,"cell_head_chars":4096},"cells_cut":0,"cells_raw":0,"read":"whole","date_system":"1900"}

{"sheet":"FP","index":0,"n_rows":101,"n_cols":7,"rows_kept":101,"cut":false,"hidden":true,"merged":[[0,6,3,19],[100,0,100,18]]}
[null," ",null,null,null,null,{"$f":"Levels!E27","v":"Inequality"}]
[]
[]
[]
[]
[]
[]
[]
[]
[]
[]
[]
[{"$f":"Levels!G39","v":0}]
[]
[]
[]
[]
[]
[]
[]
[]
[]
[]
[]
[]
[]
[]
[]
[]
[]
[]
[]
[]
[]
[]
[]
[]
[]
[]
[]
[]
[]
[]
[]
[]
[]
[]
[]
[]
[]
[]
[]
[]
[]
[]
[]
[]
[]
[]
[]
{"$rows_left_out":42}
{"sheet":"EG ","index":1,"n_rows":147,"n_cols":77,"rows_kept":147,"cut":false,"hidden":true,"merged":[[146,0,147,100],[77,21,77,34],[102,21,102,34],[132,48,134,51],[132,52,134,54],[135,48,137,54],[120,58,122,60],[120,61,122,67],[120,48,122,51],[120,52,122,54],[141,45,143,57],[120,42,122,44],[139,21,139,80],[141,35,143,41],[141,42,143,44],[141,58,143,60],[141,61,143,67],[111,21,111,80],[124,21,124,80],[126,38,128,64],[130,21,130,80],[132,35,134,41],[132,42,137,44],[132,58,137,60],[132,61,134,67],[135,35,137,41],[135,61,137,67],[113,21,113,80],[115,38,117,60],[120,35,122,41],[106,54,108,57],[106,58,108,60],[106,61,108,67],[106,35,108,41],[106,42,108,44],[106,45,108,48],[106,49,108,51],[106,52,108,53],[104,36,104,40],[104,42,104,43],[104,58,104,59],[104,62,104,66],[104,52,104,53],[94,21,94,76],[96,35,98,41],[96,42,98,44],[96,54,98,56],[96,57,98,63],[96,45,98,53],[84,21,84,44],[84,45,84,76],[86,21,86,76],[88,21,88,76],[90,38,92,60],[78,36,78,40],[78,42,78,43],[78,54,78,55],[78,58,78,62],[80,35,82,41],[80,42,82,44],[80,45,82,47],[80,48,82,49],[80,50,82,53],[80,54,82,56],[80,57,82,63],[78,48,78,49],[72,38,74,44],[72,58,74,64],[45,55,45,56],[47,58,49,64],[47,38,49,44],[45,39,45,43],[45,59,45,63],[63,45,68,47],[66,48,68,54],[70,21,70,80],[72,45,74,47],[72,55,74,57],[63,55,68,57],[63,38,65,44],[63,58,65,64],[66,38,68,44],[66,58,68,64],[72,48,74,54],[61,21,61,80],[63,48,65,51],[63,52,65,54],[51,51,51,80],[53,21,53,80],[55,21,55,80],[57,41,59,61],[41,51,41,100],[47,45,49,47],[47,48,49,51],[47,52,49,54],[47,55,49,57],[42,21,42,50],[42,51,42,80],[45,45,45,46],[41,1,41,50],[51,21,51,50],[44,21,44,34],[37,18,37,20],[37,27,37,29],[37,31,37,72],[38,27,38,29],[38,31,38,72],[31,12,31,88],[31,89,31,100],[35,27,35,29],[35,31,35,72],[36,27,36,29],[36,31,36,72],[28,10,28,49],[28,51,28,90],[26,0,26,49],[26,51,26,100],[2,0,2,2],[4,0,4,3],[6,0,6,2],[0,62,0,100],[4,4,4,6],[1,76,6,100],[4,50,4,53],[4,45,4,48],[4,14,4,22],[4,23,4,25],[4,33,4,44]]}
[{"$f":"Levels!E27","v":"Inequality"},null,null,null,null,null,null,null,null,null,null,null,null,null,null,null,null,null,null,null,null,null,null,null,null,null,null,null,null,null,null,null,null,null,null,null,null,null,null,null,null,null,null,null,null,null,null,null,null,null,null,null,null,null,null,null,null,null,null,null,null,null,{"$f":"TODAY()","v":"2015-11-11"}]
[null,null,null,null,null,null,null,null,null,null,null,null,null,null,null,null,null,null,null,null,null,null,null,null,null,null,null,null,null,null,null,null,null,null,null,null,null,null,null,null,null,null,null,null,null,null,null,null,null,null,null,null,null,null,null,null,null,null,null,null,null,null,null,null,null,null,null,null,null,null,null,null,null,null,null,null,{"$f":"Levels!AC28","v":"Inequality"}]
["LO ",null,null,{"$f":"Levels!E29","v":"To be able to solve an inequality"}]
[]
["Type",null,null,null,4,null,null,null,null,null,null,null,null,null,{"$f":"Levels!E41","v":"Level"},null,null,null,null,null,null,null,null,{"$f":"VLOOKUP($E$5,Levels!$B$42:$I$51,4,FALSE)","v":8},null,null,null,null,null,null,null,null,null," Numbers Between",null,null,null,null,null,null,null,null,null,null,null,{"$f":"VLOOKUP($E$5,Levels!$B$42:$Q$51,15,FALSE)","v":2},null,null,null,"-",{"$f":"VLOOKUP($E$5,Levels!$B$42:$S$51,17,FALSE)","v":8}]
[]
["QU",null,null,{"$f":"Levels!E33","v":"Solve the inequality"}]
[]
[]
[]
[]
[]
[]
[]
[]
[]
[]
[]
[]
[]
[]
[]
[]
[]
[]
[]
[]
[]
[]
[]
[]
[null,null,null,null,null,null,null,null,null,null,null,null,"What do the inequality signs below mean?"]
[]
[]
[]
[null,null,null,null,null,null,null,null,null,null,null,null,null,null,null,null,null,null,null,null,null,null,null,null,null,null,null,">",null,null,null,"Greater Than"]
[null,null,null,null,null,null,null,null,null,null,null,null,null,null,null,null,null,null,null,null,null,null,null,null,null,null,null,"<",null,null,null,"Less Than"]
[null,null,null,null,null,null,null,null,null,null,null,null,null,null,null,null,null,null,null,null,null,null,null,null,null,null,null,"≥",null,null,null,"Greater Than Or Equal To"]
[null,null,null,null,null,null,null,null,null,null,null,null,null,null,null,null,null,null,null,null,null,null,null,null,null,null,null,"≤",null,null,null,"Less Than Or Equal To"]
[]
[]
[]
[]
[]
[null,null,null,null,null,null,null,null,null,null,null,null,null,null,null,null,null,null,null,null,null,"Question 1"]
[null,null,null,null,null,null,null,null,null,null,null,null,null,null,null,null,null,null,null,null,null,null,null,null,null,null,null,null,null,null,null,null,null,null,null,null,null,null,null,{"$f":"RANDBETWEEN($AT$5,$AY$5)","v":7},null,null,null,null,null,{"$f":"RANDBETWEEN(1,2)","v":1},null,null,null,null,null,null,null,null,null,{"$f":"RANDBETWEEN(1,2)","v":2},null,null,null,{"$f":"AN46+RANDBETWEEN(1,10)","v":10}]
[]
[null,null,null,null,null,null,null,null,null,null,null,null,null,null,null,null,null,null,null,null,null,null,null,null,null,null,null,null,null,null,null,null,null,null,null,null,null,null,{"$f":"AW48*AN46","v":35},null,null,null,null,null,null,{"$f":"IF(AT46=1,\"≤\",\"<\")","v":"≤"},null,null,{"$f":"RANDBETWEEN(2,12)","v":5},null,null,null,"x",null,null,{"$f":"IF(BD46=1,\"≤\",\"<\")","v":"<"},null,null,{"$f":"BH46*AW48","v":50}]
[]
[]
[]
[]
[]
[null,null,null,null,null,null,null,null,null,null,null,null,null,null,null,null,null,null,null,null,null,"In order to solve this inequality we must get x on its own."]
[]
[null,null,null,null,null,null,null,null,null,null,null,null,null,null,null,null,null,null,null,null,null,"How can we get x on its own ?"]
[]
[null,null,null,null,null,null,null,null,null,null,null,null,null,null,null,null,null,null,null,null,null,null,null,null,null,null,null,null,null,null,null,null,null,null,null,null,null,null,null,null,null,{"$f":"\"Divide by \"&AW48","v":"Divide by 5"}]
[]
[]
{"$rows_left_out":88}
{"sheet":"QU","index":2,"n_rows":83,"n_cols":118,"rows_kept":83,"cut":false,"hidden":true,"merged":[[82,0,83,100],[35,3,35,5],[35,35,35,37],[35,67,35,69],[53,0,53,2],[53,34,53,36],[53,68,53,70],[77,68,79,74],[77,75,79,77],[77,78,79,90],[77,91,79,93],[77,94,79,100],[66,94,68,100],[70,68,72,74],[70,75,75,77],[70,81,72,84],[70,85,72,87],[70,91,75,93],[70,94,72,100],[73,68,75,74],[73,81,75,87],[73,94,75,100],[62,71,64,93],[66,68,68,74],[66,75,68,77],[66,81,68,84],[66,85,68,87],[66,91,68,93],[55,91,55,92],[55,95,55,99],[58,68,60,74],[58,75,60,77],[58,78,60,81],[58,82,60,84],[58,85,60,86],[58,87,60,90],[58,91,60,93],[58,94,60,100],[70,60,72,66],[73,34,75,40],[73,47,75,53],[73,60,75,66],[77,34,79,40],[77,41,79,43],[77,44,79,56],[77,57,79,59],[77,60,79,66],[70,34,72,40],[70,41,75,43],[70,47,72,50],[70,51,72,53],[70,57,75,59],[58,53,60,56],[58,57,60,59],[58,60,60,66],[62,37,64,59],[66,34,68,40],[66,41,68,43],[66,47,68,50],[66,51,68,53],[66,57,68,59],[66,60,68,66],[58,34,60,40],[58,41,60,43],[58,44,60,47],[58,48,60,50],[58,51,60,52],[70,26,72,32],[73,0,75,6],[73,13,75,19],[73,26,75,32],[77,0,79,6],[77,7,79,9],[77,10,79,22],[77,23,79,25],[77,26,79,32],[70,0,72,6],[70,7,75,9],[70,13,72,16],[70,17,72,19],[70,23,75,25],[58,19,60,22],[58,23,60,25],[58,26,60,32],[62,3,64,25],[66,0,68,6],[66,7,68,9],[66,13,68,16],[66,17,68,19],[66,23,68,25],[66,26,68,32],[58,0,60,6],[58,7,60,9],[58,10,60,13],[58,14,60,16],[58,17,60,18],[54,0,54,32],[54,34,54,66],[54,68,54,100],[55,1,55,5],[55,7,55,8],[55,17,55,18],[55,23,55,24],[55,27,55,31],[55,35,55,39],[55,41,55,42],[55,51,55,52],[55,57,55,58],[55,61,55,65],[55,69,55,73],[55,75,55,76],[55,85,55,86],[40,89,42,95],[44,70,46,92],[48,67,50,73],[48,74,50,76],[48,77,50,85],[48,86,50,88],[48,89,50,95],[40,67,42,73],[40,74,42,76],[40,77,42,79],[40,80,42,81],[40,82,42,85],[38,68,38,72],[38,74,38,75],[38,80,38,81],[38,86,38,87],[38,90,38,94],[40,54,42,56],[40,57,42,63],[44,38,46,60],[48,35,50,41],[48,42,50,44],[48,45,50,53],[48,54,50,56],[48,57,50,63],[40,35,42,41],[40,42,42,44],[40,45,42,47],[40,48,42,49],[40,50,42,53],[38,36,38,40],[38,42,38,43],[38,48,38,49],[38,54,38,55],[38,58,38,62],[40,86,42,88],[40,22,42,24],[40,25,42,31],[44,6,46,28],[48,3,50,9],[48,10,50,12],[48,13,50,21],[48,22,50,24],[48,25,50,31],[40,3,42,9],[40,10,42,12],[40,13,42,15],[40,16,42,17],[40,18,42,21],[38,4,38,8],[38,10,38,11],[38,16,38,17],[38,22,38,23],[38,26,38,30],[23,89,25,95],[26,69,28,75],[26,79,28,85],[26,89,28,95],[30,69,32,75],[30,76,32,78],[30,79,32,85],[30,86,32,88],[30,89,32,95],[23,69,25,75],[23,76,28,78],[23,79,25,82],[23,83,25,85],[23,86,28,88],[23,56,25,62],[26,36,28,42],[26,46,28,52],[26,56,28,62],[30,36,32,42],[16,70,16,74],[16,76,16,77],[16,86,16,87],[16,90,16,94],[19,69,21,75],[19,76,21,78],[19,79,21,82],[19,83,21,85],[19,86,21,88],[19,89,21,95],[30,43,32,45],[30,46,32,52],[30,53,32,55],[30,56,32,62],[23,36,25,42],[23,43,28,45],[23,46,25,49],[23,50,25,52],[23,53,28,55],[16,37,16,41],[16,43,16,44],[16,53,16,54],[16,57,16,61],[19,36,21,42],[19,43,21,45],[19,46,21,49],[19,50,21,52],[19,53,21,55],[19,56,21,62],[23,23,25,29],[26,3,28,9],[26,13,28,19],[26,23,28,29],[30,3,32,9],[30,10,32,12],[30,13,32,19],[30,20,32,22],[30,23,32,29],[23,3,25,9],[23,10,28,12],[23,13,25,16],[23,17,25,19],[23,20,28,22],[16,4,16,8],[16,10,16,11],[16,20,16,21],[16,24,16,28],[19,3,21,9],[19,10,21,12],[19,13,21,16],[19,17,21,19],[19,20,21,22],[19,23,21,29],[14,3,14,5],[14,36,14,38],[14,69,14,71],[8,117,8,128],[0,62,0,100],[1,76,6,100],[4,0,4,3],[5,45,5,48],[5,50,5,53],[4,4,4,6],[4,23,4,25],[4,14,4,22],[5,33,5,44],[6,0,6,2],[2,0,2,2]]}
[{"$f":"Levels!E27","v":"Inequality"},null,null,null,null,null,null,null,null,null,null,null,null,null,null,null,null,null,null,null,null,null,null,null,null,null,null,null,null,null,null,null,null,null,null,null,null,null,null,null,null,null,null,null,null,null,null,null,null,null,null,null,null,null,null,null,null,null,null,null,null,null,{"$f":"TODAY()","v":"2015-11-11"}]
[null,null,null,null,null,null,null,null,null,null,null,null,null,null,null,null,null,null,null,null,null,null,null,null,null,null,null,null,null,null,null,null,null,null,null,null,null,null,null,null,null,null,null,null,null,null,null,null,null,null,null,null,null,null,null,null,null,null,null,null,null,null,null,null,null,null,null,null,null,null,null,null,null,null,null,null,{"$f":"Levels!AC28","v":"Inequality"}]
["LO ",null,null,{"$f":"Levels!E29","v":"To be able to solve an inequality"}]
[]
["Type",null,null,null,1,null,null,null,null,null,null,null,null,null,{"$f":"Levels!E41","v":"Level"},null,null,null,null,null,null,null,null,{"$f":"VLOOKUP(E5,Levels!B42:I51,4,FALSE)","v":8}]
[null,null,null,null,null,null,null,null,null,null,null,null,null,null,null,null,null,null,null,null,null,null,null,null,null,null,null,null,null,null,null,null,null," Numbers Between",null,null,null,null,null,null,null,null,null,null,null,{"$f":"VLOOKUP(E5,Levels!B42:Q51,15,FALSE)","v":2},null,null,null,"-",{"$f":"VLOOKUP(E5,Levels!B42:S51,17,FALSE)","v":3}]
["QU",null,null,{"$f":"Levels!E33","v":"Solve the inequality"}]
[]
[null,null,null,null,null,null,null,null,null,null,null,null,null,null,null,null,null,null,null,null,null,null,null,null,null,null,null,null,null,null,null,null,null,null,null,null,null,null,null,null,null,null,null,null,null,null,null,null,null,null,null,null,null,null,null,null,null,null,null,null,null,null,null,null,null,null,null,null,null,null,null,null,null,null,null,null,null,null,null,null,null,null,null,null,null,null,null,null,null,null,null,null,null,null,null,null,null,null,null,null,null,null,null,null,null,null,null,null,null,null,null,null,null,null,null,null,null,"Question 1"]
[]
[]
[]
[]
[]
[null,null,null,1,null,null,null,null,null,null,null,null,null,null,null,null,null,null,null,null,null,null,null,null,null,null,null,null,null,null,null,null,null,null,null,null,{"$f":"D15+1","v":2},null,null,null,null,null,null,null,null,null,null,null,null,null,null,null,null,null,null,null,null,null,null,null,null,null,null,null,null,null,null,null,null,{"$f":"AK15+1","v":3}]
[]
[null,null,null,null,{"$f":"RANDBETWEEN($AT$6,$AY$6)","v":3},null,null,null,null,null,{"$f":"RANDBETWEEN(1,2)","v":2},null,null,null,null,null,null,null,null,null,{"$f":"RANDBETWEEN(1,2)","v":1},null,null,null,{"$f":"E17+RANDBETWEEN(1,10)","v":6},null,null,null,null,null,null,null,null,null,null,null,null,{"$f":"RANDBETWEEN($AT$6,$AY$6)","v":3},null,null,null,null,null,{"$f":"RANDBETWEEN(1,2)","v":1},null,null,null,null,null,null,null,null,null,{"$f":"RANDBETWEEN(1,2)","v":1},null,null,null,{"$f":"AL17+RANDBETWEEN(1,10)","v":4},null,null,null,null,null,null,null,null,null,null,null,null,{"$f":"RANDBETWEEN($AT$6,$AY$6)","v":2},null,null,null,null,null,{"$f":"RANDBETWEEN(1,2)","v":1},null,null,null,null,null,null,null,null,null,{"$f":"RANDBETWEEN(1,2)","v":2},null,null,null,{"$f":"BS17+RANDBETWEEN(1,10)","v":9}]
[]
[]
[null,null,null,{"$f":"N20*E17","v":33},null,null,null,null,null,null,{"$f":"IF(K17=1,\"≤\",\"<\")","v":"<"},null,null,{"$f":"RANDBETWEEN(2,12)","v":11},null,null,null,"x",null,null,{"$f":"IF(U17=1,\"≤\",\"<\")","v":"≤"},null,null,{"$f":"Y17*N20","v":66},null,null,null,null,null,null,null,null,null,null,null,null,{"$f":"AU20*AL17","v":33},null,null,null,null,null,null,{"$f":"IF(AR17=1,\"≤\",\"<\")","v":"≤"},null,null,{"$f":"RANDBETWEEN(2,12)","v":11},null,null,null,"x",null,null,{"$f":"IF(BB17=1,\"≤\",\"<\")","v":"≤"},null,null,{"$f":"BF17*AU20","v":44},null,null,null,null,null,null,null,null,null,null,null,null,{"$f":"CB20*BS17","v":16},null,null,null,null,null,null,{"$f":"IF(BY17=1,\"≤\",\"<\")","v":"≤"},null,null,{"$f":"RANDBETWEEN(2,12)","v":8},null,null,null,"x",null,null,{"$f":"IF(CI17=1,\"≤\",\"<\")","v":"<"},null,null,{"$f":"CM17*CB20","v":72}]
[]
[]
[]
[null,null,null,{"$f":"D20","v":33},null,null,null,null,null,null,{"$f":"K20","v":"<"},null,null,{"$f":"N20","v":11},null,null,null,"x",null,null,{"$f":"U20","v":"≤"},null,null,{"$f":"X20","v":66},null,null,null,null,null,null,null,null,null,null,null,null,{"$f":"AK20","v":33},null,null,null,null,null,null,{"$f":"AR20","v":"≤"},null,null,{"$f":"AU20","v":11},null,null,null,"x",null,null,{"$f":"BB20","v":"≤"},null,null,{"$f":"BE20","v":44},null,null,null,null,null,null,null,null,null,null,null,null,{"$f":"BR20","v":16},null,null,null,null,null,null,{"$f":"BY20","v":"≤"},null,null,{"$f":"CB20","v":8},null,null,null,"x",null,null,{"$f":"CI20","v":"<"},null,null,{"$f":"CL20","v":72}]
[]
[]
[null,null,null,{"$f":"N20","v":11},null,null,null,null,null,null,null,null,null,{"$f":"N20","v":11},null,null,null,null,null,null,null,null,null,{"$f":"N20","v":11},null,null,null,null,null,null,null,null,null,null,null,null,{"$f":"AU20","v":11},null,null,null,null,null,null,null,null,null,{"$f":"AU20","v":11},null,null,null,null,null,null,null,null,null,{"$f":"AU20","v":11},null,null,null,null,null,null,null,null,null,null,null,null,{"$f":"CB20","v":8},null,null,null,null,null,null,null,null,null,{"$f":"CB20","v":8},null,null,null,null,null,null,null,null,null,{"$f":"CB20","v":8}]
[]
[]
[]
[null,null,null,{"$f":"D24/D27","v":3},null,null,null,null,null,null,{"$f":"K24","v":"<"},null,null,"x",null,null,null,null,null,null,{"$f":"U24","v":"≤"},null,null,{"$f":"X24/X27","v":6},null,null,null,null,null,null,null,null,null,null,null,null,{"$f":"AK24/AK27","v":3},null,null,null,null,null,null,{"$f":"AR24","v":"≤"},null,null,"x",null,null,null,null,null,null,{"$f":"BB24","v":"≤"},null,null,{"$f":"BE24/BE27","v":4},null,null,null,null,null,null,null,null,null,null,null,null,{"$f":"BR24/BR27","v":2},null,null,null,null,null,null,{"$f":"BY24","v":"≤"},null,null,"x",null,null,null,null,null,null,{"$f":"CI24","v":"<"},null,null,{"$f":"CL24/CL27","v":9}]
[]
[]
[]
[]
[null,null,null,4,null,null,null,null,null,null,null,null,null,null,null,null,null,null,null,null,null,null,null,null,null,null,null,null,null,null,null,null,null,null,null,{"$f":"D36+1","v":5},null,null,null,null,null,null,null,null,null,null,null,null,null,null,null,null,null,null,null,null,null,null,null,null,null,null,null,null,null,null,null,{"$f":"AJ36+1","v":6}]
[]
[]
[null,null,null,null,{"$f":"RANDBETWEEN($AT$6,$AY$6)","v":2},null,null,null,null,null,{"$f":"RANDBETWEEN(1,2)","v":1},null,null,null,null,null,{"$f":"RANDBETWEEN(1,2)","v":1},null,null,null,null,null,{"$f":"RANDBETWEEN(1,2)","v":1},null,null,null,{"$f":"E39+RANDBETWEEN(1,10)","v":7},null,null,null,null,null,null,null,null,null,{"$f":"RANDBETWEEN($AT$6,$AY$6)","v":3},null,null,null,null,null,{"$f":"RANDBETWEEN(1,2)","v":1},null,null,null,null,null,{"$f":"RANDBETWEEN(1,2)","v":2},null,null,null,null,null,{"$f":"RANDBETWEEN(1,2)","v":2},null,null,null,{"$f":"AK39+RANDBETWEEN(1,10)","v":11},null,null,null,null,null,null,null,null,null,{"$f":"RANDBETWEEN($AT$6,$AY$6)","v":3},null,null,null,null,null,{"$f":"RANDBETWEEN(1,2)","v":1},null,null,null,null,null,{"$f":"RANDBETWEEN(1,2)","v":1},null,null,null,null,null,{"$f":"RANDBETWEEN(1,2)","v":1},null,null,null,{"$f":"BQ39+RANDBETWEEN(1,10)","v":5}]
[]
[null,null,null,{"$f":"E39","v":2},null,null,null,null,null,null,{"$f":"IF(K39=1,\"≤\",\"<\")","v":"≤"},null,null,"x",null,null,{"$f":"IF(Q39=1,\"+\",\"-\")","v":"+"},null,{"$f":"RANDBETWEEN(2,12)","v":11},null,null,null,{"$f":"IF(W39=1,\"≤\",\"<\")","v":"≤"},null,null,{"$f":"AA39","v":7},null,null,null,null,null,null,null,null,null,{"$f":"AK39","v":3},null,null,null,null,null,null,{"$f":"IF(AQ39=1,\"≤\",\"<\")","v":"≤"},null,null,"x",null,null,{"$f":"IF(AW39=1,\"+\",\"-\")","v":"-"},null,{"$f":"RANDBETWEEN(2,12)","v":4},null,null,null,{"$f":"IF(BC39=1,\"≤\",\"<\")","v":"<"},null,null,{"$f":"BG39","v":11},null,null,null,null,null,null,null,null,null,{"$f":"BQ39","v":3},null,null,null,null,null,null,{"$f":"IF(BW39=1,\"≤\",\"<\")","v":"≤"},null,null,"x",null,null,{"$f":"IF(CC39=1,\"+\",\"-\")","v":"+"},null,{"$f":"RANDBETWEEN(2,12)","v":9},null,null,null,{"$f":"IF(CI39=1,\"≤\",\"<\")","v":"≤"},null,null,{"$f":"CM39","v":5}]
[]
[]
[]
[null,null,null,null,null,null,{"$f":"IF(Q41=\"+\",\"Subtract \"&S41,\"Add \"&S41)","v":"Subtract 11"},null,null,null,null,null,null,null,null,null,null,null,null,null,null,null,null,null,null,null,null,null,null,null,null,null,null,null,null,null,null,null,{"$f":"IF(AW41=\"+\",\"Subtract \"&AY41,\"Add \"&AY41)","v":"Add 4"},null,null,null,null,null,null,null,null,null,null,null,null,null,null,null,null,null,null,null,null,null,null,null,null,null,null,null,null,null,null,null,{"$f":"IF(CC41=\"+\",\"Subtract \"&CE41,\"Add \"&CE41)","v":"Subtract 9"}]
[]
[]
[]
[null,null,null,{"$f":"IF(Q39-1,D41+S41,D41-S41)","v":-9},null,null,null,null,null,null,{"$f":"K41","v":"≤"},null,null,"x",null,null,null,null,null,null,null,null,{"$f":"W41","v":"≤"},null,null,{"$f":"IF(Q39=1,Z41-S41,Z41+S41)","v":-4},null,null,null,null,null,null,null,null,null,{"$f":"IF(AW39-1,AJ41+AY41,AJ41-AY41)","v":7},null,null,null,null,null,null,{"$f":"AQ41","v":"≤"},null,null,"x",null,null,null,null,null,null,null,null,{"$f":"BC41","v":"<"},null,null,{"$f":"IF(AW39=1,BF41-AY41,BF41+AY41)","v":15},null,null,null,null,null,null,null,null,null,{"$f":"IF(CC39-1,BP41+CE41,BP41-CE41)","v":-6},null,null,null,null,null,null,{"$f":"BW41","v":"≤"},null,null,"x",null,null,null,null,null,null,null,null,{"$f":"CI41","v":"≤"},null,null,{"$f":"IF(CC39=1,CL41-CE41,CL41+CE41)","v":-4}]
[]
[]
[]
[]
[{"$f":"BP36+1","v":7},null,null,null,null,null,null,null,null,null,null,null,null,null,null,null,null,null,null,null,null,null,null,null,null,null,null,null,null,null,null,null,null,null,{"$f":"A54+1","v":8},null,null,null,null,null,null,null,null,null,null,null,null,null,null,null,null,null,null,null,null,null,null,null,null,null,null,null,null,null,null,null,null,null,{"$f":"AI54+1","v":9}]
[]
[null,{"$f":"RANDBETWEEN($AT$6,$AY$6)","v":2},null,null,null,null,null,{"$f":"RANDBETWEEN(1,2)","v":1},null,null,null,null,null,null,null,null,null,{"$f":"RANDBETWEEN(1,2)","v":2},null,null,null,null,null,{"$f":"RANDBETWEEN(1,2)","v":2},null,null,null,{"$f":"A67+(K59*RANDBETWEEN(2,4))","v":35},null,null,null,null,null,null,null,{"$f":"RANDBETWEEN($AT$6,$AY$6)","v":3},null,null,null,null,null,{"$f":"RANDBETWEEN(1,2)","v":1},null,null,null,null,null,null,null,null,null,{"$f":"RANDBETWEEN(1,2)","v":2},null,null,null,null,null,{"$f":"RANDBETWEEN(1,2)","v":2},null,null,null,{"$f":"AI67+(AS59*RANDBETWEEN(2,4))","v":20},null,null,null,null,null,null,null,{"$f":"RANDBETWEEN($AT$6,$AY$6)","v":2},null,null,null,null,null,{"$f":"RANDBETWEEN(1,2)","v":1},null,null,null,null,null,null,null,null,null,{"$f":"RANDBETWEEN(1,2)","v":2},null,null,null,null,null,{"$f":"RANDBETWEEN(1,2)","v":2},null,null,null,{"$f":"BQ67+(CA59*RANDBETWEEN(2,4))","v":44}]
[]
[]
[{"$f":"IF(R56=1,(K59*B56)+T59,(K59*B56)-T59)","v":9},null,null,null,null,null,null,{"$f":"IF(H56=1,\"≤\",\"<\")","v":"≤"},null,null,{"$f":"RANDBETWEEN(2,12)","v":7},null,null,null,"x",null,null,{"$f":"IF(R56=1,\"+\",\"-\")","v":"-"},null,{"$f":"RANDBETWEEN(2,12)","v":5},null,null,null,{"$f":"IF(X56=1,\"≤\",\"<\")","v":"<"},null,null,{"$f":"IF(R56=1,AB56+T59,AB56-T59)","v":30},null,null,null,null,null,null,null,{"$f":"IF(AZ56=1,(AS59*AJ56)+BB59,(AS59*AJ56)-BB59)","v":6},null,null,null,null,null,null,{"$f":"IF(AP56=1,\"≤\",\"<\")","v":"≤"},null,null,{"$f":"RANDBETWEEN(2,12)","v":4},null,null,null,"x",null,null,{"$f":"IF(AZ56=1,\"+\",\"-\")","v":"-"},null,{"$f":"RANDBETWEEN(2,12)","v":6},null,null,null,{"$f":"IF(BF56=1,\"≤\",\"<\")","v":"<"},null,null,{"$f":"IF(AZ56=1,BJ56+BB59,BJ56-BB59)","v":14},null,null,null,null,null,null,null,{"$f":"IF(CH56=1,(CA59*BR56)+CJ59,(CA59*BR56)-CJ59)","v":13},null,null,null,null,null,null,{"$f":"IF(BX56=1,\"≤\",\"<\")","v":"≤"},null,null,{"$f":"RANDBETWEEN(2,12)","v":11},null,null,null,"x",null,null,{"$f":"IF(CH56=1,\"+\",\"-\")","v":"-"},null,{"$f":"RANDBETWEEN(2,12)","v":9},null,null,null,{"$f":"IF(CN56=1,\"≤\",\"<\")","v":"<"},null,null,{"$f":"IF(CH56=1,CR56+CJ59,CR56-CJ59)","v":35}]
[]
{"$rows_left_out":24}
{"sheet":"Levels","index":3,"n_rows":76,"n_cols":29,"rows_kept":76,"cut":false,"hidden":true,"merged":[[50,4,50,8],[45,4,45,8],[46,4,46,8],[47,4,47,8],[48,4,48,8],[49,4,49,8],[45,11,45,12],[46,11,46,12],[47,11,47,12],[44,15,44,16],[40,4,40,8],[41,4,41,8],[42,4,42,8],[43,4,43,8],[44,4,44,8],[45,15,45,16],[44,17,44,18],[50,15,50,16],[50,17,50,18],[47,15,47,16],[40,11,40,12],[41,11,41,12],[42,11,42,12],[43,17,43,18],[40,15,40,18],[43,15,43,16],[43,11,43,12],[41,15,41,16],[41,17,41,18],[42,15,42,16],[42,17,42,18],[44,11,44,12],[45,17,45,18],[46,15,46,16],[46,17,46,18],[48,15,48,16],[48,17,48,18],[53,0,53,52],[32,57,32,58],[28,26,28,27],[26,4,26,24],[28,4,28,25],[32,4,32,25],[26,28,26,52],[27,28,32,52],[28,1,28,3],[32,1,32,3],[49,15,49,16],[49,17,49,18],[47,17,47,18],[50,11,50,12],[48,11,48,12],[49,11,49,12]]}
[]
[]
[]
[]
[]
[]
[]
[]
[]
[]
[]
[]
[]
[]
[]
[]
[]
[]
[]
[]
[]
[]
[]
[]
[]
[]
[null,"Title",null,null,"Inequality"]
[null,null,null,null,null,null,null,null,null,null,null,null,null,null,null,null,null,null,null,null,null,null,null,null,null,null,null,null,"Inequality"]
[null,"LO ",null,null,"To be able to solve an inequality",null,null,null,null,null,null,null,null,null,null,null,null,null,null,null,null,null,null,null,null,null,"keywords"]
[]
[]
[]
[null,"QU",null,null,"Solve the inequality"]
[]
[]
[]
[]
[]
[]
[]
[null,"Type",null,null,"Level",null,null,null,null,null,null,"Grade",null,null,null,"Numbers between ",null,null,null,null,80]
[null,1,null,null,8,null,null,null,null,null,null,"B",null,null,null,2,null,3]
[null,2,null,null,8,null,null,null,null,null,null,"B",null,null,null,2,null,6]
[null,3,null,null,8,null,null,null,null,null,null,"B",null,null,null,2,null,7]
[null,4,null,null,8,null,null,null,null,null,null,"B",null,null,null,2,null,8]
[null,5,null,null,8,null,null,null,null,null,null,"B",null,null,null,2,null,9]
[null,6,null,null,8,null,null,null,null,null,null,"B",null,null,null,2,null,10]
[null,7,null,null,8,null,null,null,null,null,null,"B",null,null,null,2,null,11]
[null,8,null,null,8,null,null,null,null,null,null,"B",null,null,null,2,null,12]
[null,9,null,null,8,null,null,null,null,null,null,"B",null,null,null,2,null,13]
[null,10,null,null,8,null,null,null,null,null,null,"B",null,null,null,2,null,20]
[]
[]
[{"$f":"FP!A101","v":"© 2015, Maths Kingdom, All Rights Reserved"}]
["Level","G"]
["Grade","F",null,null,null,null,null,null,null,null,null,null,null,null,"Select from the list provided"]
[null,"E"]
[null,"D"]
[null,"C"]
[null,"B"]
{"$rows_left_out":17}
{"sheet":"EM","index":4,"n_rows":0,"n_cols":0,"rows_kept":0,"cut":false,"hidden":false,"merged":[]}